BDBM50105173 4-(4-Amino-phenoxy)-thieno[2,3-c]pyridine-2-carboxylic acid amide::CHEMBL117936
SMILES NC(=O)c1cc2c(Oc3ccc(N)cc3)cncc2s1
InChI Key InChIKey=BFDUIWWBUSVVMR-UHFFFAOYSA-N
Data  3 IC50
  Tab Delimited (TSV)   2D SDfile   Computed 3D by Vconf -m prep SDfile
Find this compound or compounds like it in BindingDB:
Activity Spreadsheet -- Enzyme Inhibition Constant Data from BindingDB
Found 1 hit for monomerid = 50105173
TargetIntercellular adhesion molecule 1(Homo sapiens (Human))
Abbott Laboratories
Curated by ChEMBL
LigandPNGBDBM50105173(4-(4-Amino-phenoxy)-thieno[2,3-c]pyridine-2-carbox...)
Affinity DataIC50:  42nM. Assay description: Inhibition of intercellular adhesion molecule-1 (ICAM1) in human endothelial cells
In DepthDetails ArticlePubMed